BDBM50014931 CHEMBL3262062
SMILES O=C1C(NS(=O)(=O)c2ccccc2)=C(c2ccoc2)C(=O)c2ccccc12
InChI Key InChIKey=INMDWVVNTDJSNE-UHFFFAOYSA-N
Data  2 IC50
  Tab Delimited (TSV)   2D SDfile   Computed 3D by Vconf -m prep SDfile
Find this compound or compounds like it in BindingDB:
Activity Spreadsheet -- Enzyme Inhibition Constant Data from BindingDB
Found 1 hit for monomerid = 50014931
TargetArylamine N-acetyltransferase 2(Mus musculus)
University Of Oxford
Curated by ChEMBL
LigandPNGBDBM50014931(CHEMBL3262062)
Affinity DataIC50:  1.40E+3nM. Assay description: Inhibition of recombinant N-terminal His6-tagged mouse NAT2 expressed in Escherichia coli Rosetta(DE3)pLysS cells assessed as rate of free thiol coen...
In DepthDetails ArticlePubMed